Restore data from crashed MariaDB

I need to retrieve a mysql dump from suddenly stopped database. Database worked in kubernetes cluster as a bitnami/mariadb chart of version 6.7.4. Was configured a slave and month ago it was stopped, but replication process was still in progress.
Slave was stopped by mistake – killed pod which could not started:
Database was crashed probably due to lack of disk space (because of huge binary logs gathered)

Fisrt error I see was:
enter image description here

I have a full snapshot of database data directory. I have a full database schema, so I tried to install empty schema and replace all empty .idb files into same with data

After replacing and restarting mariadb I see an errors like that:

MariaDB (store)> select * from admin;
ERROR 1932 (42S02): Table 'store.admin' doesn't exist in engine

I ran mysql_upgrade but stil see same errors:

backend % mysql_upgrade -u store -p
Enter password: 
Phase 1/7: Checking and upgrading mysql database
Processing databases
mysql
mysql.column_stats                                 OK
mysql.columns_priv                                 OK
mysql.db                                           OK
mysql.event                                        OK
mysql.func                                         OK
mysql.global_priv                                  OK
mysql.gtid_slave_pos                               OK
mysql.help_category                                OK
mysql.help_keyword                                 OK
mysql.help_relation                                OK
mysql.help_topic                                   OK
mysql.index_stats                                  OK
mysql.innodb_index_stats                           OK
mysql.innodb_table_stats                           OK
mysql.plugin                                       OK
mysql.proc                                         OK
mysql.procs_priv                                   OK
mysql.proxies_priv                                 OK
mysql.roles_mapping                                OK
mysql.servers                                      OK
mysql.table_stats                                  OK
mysql.tables_priv                                  OK
mysql.time_zone                                    OK
mysql.time_zone_leap_second                        OK
mysql.time_zone_name                               OK
mysql.time_zone_transition                         OK
mysql.time_zone_transition_type                    OK
mysql.transaction_registry                         OK
Phase 2/7: Installing used storage engines... Skipped
Phase 3/7: Fixing views
mysql.user                                         OK
sys.host_summary                                   OK
sys.host_summary_by_file_io                        OK
sys.host_summary_by_file_io_type                   OK
sys.host_summary_by_stages                         OK
sys.host_summary_by_statement_latency              OK
sys.host_summary_by_statement_type                 OK
sys.innodb_buffer_stats_by_schema                  OK
sys.innodb_buffer_stats_by_table                   OK
sys.innodb_lock_waits                              OK
sys.io_by_thread_by_latency                        OK
sys.io_global_by_file_by_bytes                     OK
sys.io_global_by_file_by_latency                   OK
sys.io_global_by_wait_by_bytes                     OK
sys.io_global_by_wait_by_latency                   OK
sys.latest_file_io                                 OK
sys.memory_by_host_by_current_bytes                OK
sys.memory_by_thread_by_current_bytes              OK
sys.memory_by_user_by_current_bytes                OK
sys.memory_global_by_current_bytes                 OK
sys.memory_global_total                            OK
sys.metrics                                        OK
sys.processlist                                    OK
sys.ps_check_lost_instrumentation                  OK
sys.schema_auto_increment_columns                  OK
sys.schema_index_statistics                        OK
sys.schema_object_overview                         OK
sys.schema_redundant_indexes                       OK
sys.schema_table_lock_waits                        OK
sys.schema_table_statistics                        OK
sys.schema_table_statistics_with_buffer            OK
sys.schema_tables_with_full_table_scans            OK
sys.schema_unused_indexes                          OK
sys.session                                        OK
sys.session_ssl_status                             OK
sys.statement_analysis                             OK
sys.statements_with_errors_or_warnings             OK
sys.statements_with_full_table_scans               OK
sys.statements_with_runtimes_in_95th_percentile    OK
sys.statements_with_sorting                        OK
sys.statements_with_temp_tables                    OK
sys.user_summary                                   OK
sys.user_summary_by_file_io                        OK
sys.user_summary_by_file_io_type                   OK
sys.user_summary_by_stages                         OK
sys.user_summary_by_statement_latency              OK
sys.user_summary_by_statement_type                 OK
sys.version                                        OK
sys.wait_classes_global_by_avg_latency             OK
sys.wait_classes_global_by_latency                 OK
sys.waits_by_host_by_latency                       OK
sys.waits_by_user_by_latency                       OK
sys.waits_global_by_latency                        OK
sys.x$host_summary                                 OK
sys.x$host_summary_by_file_io                      OK
sys.x$host_summary_by_file_io_type                 OK
sys.x$host_summary_by_stages                       OK
sys.x$host_summary_by_statement_latency            OK
sys.x$host_summary_by_statement_type               OK
sys.x$innodb_buffer_stats_by_schema                OK
sys.x$innodb_buffer_stats_by_table                 OK
sys.x$innodb_lock_waits                            OK
sys.x$io_by_thread_by_latency                      OK
sys.x$io_global_by_file_by_bytes                   OK
sys.x$io_global_by_file_by_latency                 OK
sys.x$io_global_by_wait_by_bytes                   OK
sys.x$io_global_by_wait_by_latency                 OK
sys.x$latest_file_io                               OK
sys.x$memory_by_host_by_current_bytes              OK
sys.x$memory_by_thread_by_current_bytes            OK
sys.x$memory_by_user_by_current_bytes              OK
sys.x$memory_global_by_current_bytes               OK
sys.x$memory_global_total                          OK
sys.x$processlist                                  OK
sys.x$ps_digest_95th_percentile_by_avg_us          OK
sys.x$ps_digest_avg_latency_distribution           OK
sys.x$ps_schema_table_statistics_io                OK
sys.x$schema_flattened_keys                        OK
sys.x$schema_index_statistics                      OK
sys.x$schema_table_lock_waits                      OK
sys.x$schema_table_statistics                      OK
sys.x$schema_table_statistics_with_buffer          OK
sys.x$schema_tables_with_full_table_scans          OK
sys.x$session                                      OK
sys.x$statement_analysis                           OK
sys.x$statements_with_errors_or_warnings           OK
sys.x$statements_with_full_table_scans             OK
sys.x$statements_with_runtimes_in_95th_percentile  OK
sys.x$statements_with_sorting                      OK
sys.x$statements_with_temp_tables                  OK
sys.x$user_summary                                 OK
sys.x$user_summary_by_file_io                      OK
sys.x$user_summary_by_file_io_type                 OK
sys.x$user_summary_by_stages                       OK
sys.x$user_summary_by_statement_latency            OK
sys.x$user_summary_by_statement_type               OK
sys.x$wait_classes_global_by_avg_latency           OK
sys.x$wait_classes_global_by_latency               OK
sys.x$waits_by_host_by_latency                     OK
sys.x$waits_by_user_by_latency                     OK
sys.x$waits_global_by_latency                      OK
Phase 4/7: Running 'mysql_fix_privilege_tables'
Phase 5/7: Fixing table and database names
Phase 6/7: Checking and upgrading tables
Processing databases
information_schema
performance_schema
store
store.account
Error    : Table 'store.account' doesn't exist in engine
status   : Operation failed
store.account_event
Error    : Table 'store.account_event' doesn't exist in engine
status   : Operation failed
store.account_setting
Error    : Table 'store.account_setting' doesn't exist in engine
status   : Operation failed
store.admin
Error    : Table 'store.admin' doesn't exist in engine
status   : Operation failed
store.aggregated_actions_daily
Error    : Table 'store.aggregated_actions_daily' doesn't exist in engine
status   : Operation failed
store.aggregated_report_daily
Error    : Table 'store.aggregated_report_daily' doesn't exist in engine
status   : Operation failed
store.aggregated_report_daily_total
Error    : Table 'store.aggregated_report_daily_total' doesn't exist in engine
status   : Operation failed
store.aggregated_report_monthly
Error    : Table 'store.aggregated_report_monthly' doesn't exist in engine
status   : Operation failed
store.aggregated_report_weekly
Error    : Table 'store.aggregated_report_weekly' doesn't exist in engine
status   : Operation failed
store.aggregated_trainer
Error    : Table 'store.aggregated_trainer' doesn't exist in engine
status   : Operation failed
store.apple_price
Error    : Table 'store.apple_price' doesn't exist in engine
status   : Operation failed
store.apple_tier_price
Error    : Table 'store.apple_tier_price' doesn't exist in engine
status   : Operation failed
store.country
Error    : Table 'store.country' doesn't exist in engine
status   : Operation failed
store.course
Error    : Table 'store.course' doesn't exist in engine
status   : Operation failed
store.course_container
Error    : Table 'store.course_container' doesn't exist in engine
status   : Operation failed
store.course_container_course_dietary_program
Error    : Table 'store.course_container_course_dietary_program' doesn't exist in engine
status   : Operation failed
store.course_container_course_education_program
Error    : Table 'store.course_container_course_education_program' doesn't exist in engine
status   : Operation failed
store.course_container_course_workout_program
Error    : Table 'store.course_container_course_workout_program' doesn't exist in engine
status   : Operation failed
store.course_day
Error    : Table 'store.course_day' doesn't exist in engine
status   : Operation failed
store.course_dietary_program
Error    : Table 'store.course_dietary_program' doesn't exist in engine
status   : Operation failed
store.course_education_program
Error    : Table 'store.course_education_program' doesn't exist in engine
status   : Operation failed
store.course_price
Error    : Table 'store.course_price' doesn't exist in engine
status   : Operation failed
store.course_workout_program
Error    : Table 'store.course_workout_program' doesn't exist in engine
status   : Operation failed
store.credit_card
Error    : Table 'store.credit_card' doesn't exist in engine
status   : Operation failed
store.currency_rate
Error    : Table 'store.currency_rate' doesn't exist in engine
status   : Operation failed
store.daily_nutrition
Error    : Table 'store.daily_nutrition' doesn't exist in engine
status   : Operation failed
store.daily_recipe
Error    : Table 'store.daily_recipe' doesn't exist in engine
status   : Operation failed
store.diet
Error    : Table 'store.diet' doesn't exist in engine
status   : Operation failed
store.diet_recipe
Error    : Table 'store.diet_recipe' doesn't exist in engine
status   : Operation failed
store.dietary_program
Error    : Table 'store.dietary_program' doesn't exist in engine
status   : Operation failed
store.dietary_program_day
Error    : Table 'store.dietary_program_day' doesn't exist in engine
status   : Operation failed
store.education_program
Error    : Table 'store.education_program' doesn't exist in engine
status   : Operation failed
store.education_program_day
Error    : Table 'store.education_program_day' doesn't exist in engine
status   : Operation failed
store.exercise
Error    : Table 'store.exercise' doesn't exist in engine
status   : Operation failed
store.exercise_step
Error    : Table 'store.exercise_step' doesn't exist in engine
status   : Operation failed
store.file
Error    : Table 'store.file' doesn't exist in engine
status   : Operation failed
store.food
Error    : Table 'store.food' doesn't exist in engine
status   : Operation failed
store.food_copy
Error    : Table 'store.food_copy' doesn't exist in engine
status   : Operation failed
store.lesson
Error    : Table 'store.lesson' doesn't exist in engine
status   : Operation failed
store.lesson_pack
Error    : Table 'store.lesson_pack' doesn't exist in engine
status   : Operation failed
store.lesson_pack_lesson
Error    : Table 'store.lesson_pack_lesson' doesn't exist in engine
status   : Operation failed
store.marathon
Error    : Table 'store.marathon' doesn't exist in engine
status   : Operation failed
store.marathon_day
Error    : Table 'store.marathon_day' doesn't exist in engine
status   : Operation failed
store.note
Error    : Table 'store.note' doesn't exist in engine
status   : Operation failed
store.nutrition
Error    : Table 'store.nutrition' doesn't exist in engine
status   : Operation failed
store.nutrition_recipe
Error    : Table 'store.nutrition_recipe' doesn't exist in engine
status   : Operation failed
store.payment_intention
Error    : Table 'store.payment_intention' doesn't exist in engine
status   : Operation failed
store.payment_transaction
Error    : Table 'store.payment_transaction' doesn't exist in engine
status   : Operation failed
store.payment_transaction_apple_in_app
Error    : Table 'store.payment_transaction_apple_in_app' doesn't exist in engine
status   : Operation failed
store.payment_transaction_bt
Error    : Table 'store.payment_transaction_bt' doesn't exist in engine
status   : Operation failed
store.payment_transaction_cp
Error    : Table 'store.payment_transaction_cp' doesn't exist in engine
status   : Operation failed
store.payment_transaction_ym
Error    : Table 'store.payment_transaction_ym' doesn't exist in engine
status   : Operation failed
store.payout_transaction
Error    : Table 'store.payout_transaction' doesn't exist in engine
status   : Operation failed
store.payout_transaction_payment_transaction
Error    : Table 'store.payout_transaction_payment_transaction' doesn't exist in engine
status   : Operation failed
store.phone_verification
Error    : Table 'store.phone_verification' doesn't exist in engine
status   : Operation failed
store.product
Error    : Table 'store.product' doesn't exist in engine
status   : Operation failed
store.recipe
Error    : Table 'store.recipe' doesn't exist in engine
status   : Operation failed
store.recipe_food
Error    : Table 'store.recipe_food' doesn't exist in engine
status   : Operation failed
store.recipe_step
Error    : Table 'store.recipe_step' doesn't exist in engine
status   : Operation failed
store.sales_order
Error    : Table 'store.sales_order' doesn't exist in engine
status   : Operation failed
store.sales_order_item
Error    : Table 'store.sales_order_item' doesn't exist in engine
status   : Operation failed
store.time_slot
Error    : Table 'store.time_slot' doesn't exist in engine
status   : Operation failed
store.top_group_product
Error    : Table 'store.top_group_product' doesn't exist in engine
status   : Operation failed
store.top_home_product
Error    : Table 'store.top_home_product' doesn't exist in engine
status   : Operation failed
store.top_month_product
Error    : Table 'store.top_month_product' doesn't exist in engine
status   : Operation failed
store.top_product
Error    : Table 'store.top_product' doesn't exist in engine
status   : Operation failed
store.top_trainer
Error    : Table 'store.top_trainer' doesn't exist in engine
status   : Operation failed
store.trainer
Error    : Table 'store.trainer' doesn't exist in engine
status   : Operation failed
store.trainer_action
Error    : Table 'store.trainer_action' doesn't exist in engine
status   : Operation failed
store.trainer_chat_link
Error    : Table 'store.trainer_chat_link' doesn't exist in engine
status   : Operation failed
store.trainer_event
Error    : Table 'store.trainer_event' doesn't exist in engine
status   : Operation failed
store.trainer_event_message                    OK
store.trainer_notification_task
Error    : Table 'store.trainer_notification_task' doesn't exist in engine
status   : Operation failed
store.trainer_payout_info
Error    : Table 'store.trainer_payout_info' doesn't exist in engine
status   : Operation failed
store.trainer_status_message
Error    : Table 'store.trainer_status_message' doesn't exist in engine
status   : Operation failed
store.training
Error    : Table 'store.training' doesn't exist in engine
status   : Operation failed
store.training_exercise
Error    : Table 'store.training_exercise' doesn't exist in engine
status   : Operation failed
store.user
Error    : Table 'store.user' doesn't exist in engine
status   : Operation failed
store.user_course
Error    : Table 'store.user_course' doesn't exist in engine
status   : Operation failed
store.user_course_job
Error    : Table 'store.user_course_job' doesn't exist in engine
status   : Operation failed
store.user_device
Error    : Table 'store.user_device' doesn't exist in engine
status   : Operation failed
store.user_measurement_activity
Error    : Table 'store.user_measurement_activity' doesn't exist in engine
status   : Operation failed
store.user_measurement_belly
Error    : Table 'store.user_measurement_belly' doesn't exist in engine
status   : Operation failed
store.user_measurement_biceps
Error    : Table 'store.user_measurement_biceps' doesn't exist in engine
status   : Operation failed
store.user_measurement_bust
Error    : Table 'store.user_measurement_bust' doesn't exist in engine
status   : Operation failed
store.user_measurement_calf
Error    : Table 'store.user_measurement_calf' doesn't exist in engine
status   : Operation failed
store.user_measurement_gender
Error    : Table 'store.user_measurement_gender' doesn't exist in engine
status   : Operation failed
store.user_measurement_height
Error    : Table 'store.user_measurement_height' doesn't exist in engine
status   : Operation failed
store.user_measurement_hips
Error    : Table 'store.user_measurement_hips' doesn't exist in engine
status   : Operation failed
store.user_measurement_lactation
Error    : Table 'store.user_measurement_lactation' doesn't exist in engine
status   : Operation failed
store.user_measurement_neck
Error    : Table 'store.user_measurement_neck' doesn't exist in engine
status   : Operation failed
store.user_measurement_single_hip
Error    : Table 'store.user_measurement_single_hip' doesn't exist in engine
status   : Operation failed
store.user_measurement_waist
Error    : Table 'store.user_measurement_waist' doesn't exist in engine
status   : Operation failed
store.user_measurement_weight
Error    : Table 'store.user_measurement_weight' doesn't exist in engine
status   : Operation failed
store.user_product
Error    : Table 'store.user_product' doesn't exist in engine
status   : Operation failed
store.user_progress_report
Error    : Table 'store.user_progress_report' doesn't exist in engine
status   : Operation failed
store.user_progress_report_request
Error    : Table 'store.user_progress_report_request' doesn't exist in engine
status   : Operation failed
store.user_trainer
Error    : Table 'store.user_trainer' doesn't exist in engine
status   : Operation failed
store.user_trainer_referrer
Error    : Table 'store.user_trainer_referrer' doesn't exist in engine
status   : Operation failed
store.video
Error    : Table 'store.video' doesn't exist in engine
status   : Operation failed
store.workout_program
Error    : Table 'store.workout_program' doesn't exist in engine
status   : Operation failed
store.workout_program_day
Error    : Table 'store.workout_program_day' doesn't exist in engine
status   : Operation failed
sys
sys.sys_config                                     OK
test

Repairing tables
store.account
Error    : Table 'store.account' doesn't exist in engine
status   : Operation failed
store.account_event
Error    : Table 'store.account_event' doesn't exist in engine
status   : Operation failed
store.account_setting
Error    : Table 'store.account_setting' doesn't exist in engine
status   : Operation failed
store.admin
Error    : Table 'store.admin' doesn't exist in engine
status   : Operation failed
store.aggregated_actions_daily
Error    : Table 'store.aggregated_actions_daily' doesn't exist in engine
status   : Operation failed
store.aggregated_report_daily
Error    : Table 'store.aggregated_report_daily' doesn't exist in engine
status   : Operation failed
store.aggregated_report_daily_total
Error    : Table 'store.aggregated_report_daily_total' doesn't exist in engine
status   : Operation failed
store.aggregated_report_monthly
Error    : Table 'store.aggregated_report_monthly' doesn't exist in engine
status   : Operation failed
store.aggregated_report_weekly
Error    : Table 'store.aggregated_report_weekly' doesn't exist in engine
status   : Operation failed
store.aggregated_trainer
Error    : Table 'store.aggregated_trainer' doesn't exist in engine
status   : Operation failed
store.apple_price
Error    : Table 'store.apple_price' doesn't exist in engine
status   : Operation failed
store.apple_tier_price
Error    : Table 'store.apple_tier_price' doesn't exist in engine
status   : Operation failed
store.country
Error    : Table 'store.country' doesn't exist in engine
status   : Operation failed
store.course
Error    : Table 'store.course' doesn't exist in engine
status   : Operation failed
store.course_container
Error    : Table 'store.course_container' doesn't exist in engine
status   : Operation failed
store.course_container_course_dietary_program
Error    : Table 'store.course_container_course_dietary_program' doesn't exist in engine
status   : Operation failed
store.course_container_course_education_program
Error    : Table 'store.course_container_course_education_program' doesn't exist in engine
status   : Operation failed
store.course_container_course_workout_program
Error    : Table 'store.course_container_course_workout_program' doesn't exist in engine
status   : Operation failed
store.course_day
Error    : Table 'store.payout_transaction_payment_transaction' doesn't exist in engine
status   : Operation failed
store.phone_verification
Error    : Table 'store.phone_verification' doesn't exist in engine
status   : Operation failed
store.product
Error    : Table 'store.product' doesn't exist in engine
status   : Operation failed
store.recipe
Error    : Table 'store.recipe' doesn't exist in engine
status   : Operation failed
store.recipe_food
Error    : Table 'store.recipe_food' doesn't exist in engine
status   : Operation failed
store.recipe_step
Error    : Table 'store.recipe_step' doesn't exist in engine
status   : Operation failed
store.sales_order
Error    : Table 'store.sales_order' doesn't exist in engine
status   : Operation failed
store.sales_order_item
Error    : Table 'store.sales_order_item' doesn't exist in engine
status   : Operation failed
store.time_slot
Error    : Table 'store.time_slot' doesn't exist in engine
status   : Operation failed
store.top_group_product
Error    : Table 'store.top_group_product' doesn't exist in engine
status   : Operation failed
store.top_home_product
Error    : Table 'store.top_home_product' doesn't exist in engine
status   : Operation failed
store.top_month_product
Error    : Table 'store.top_month_product' doesn't exist in engine
status   : Operation failed
store.top_product
Error    : Table 'store.workout_program_day' doesn't exist in engine
status   : Operation failed
Phase 7/7: Running 'FLUSH PRIVILEGES'
OK

Is there any way to restore this data? Thanks in advance!

python – Flask app cannot be deployed on heroku – app crashed H10

My first web app works flawlessly locally, but on Heroku I just can’t get it deployed.
I would be very thankful if you can help me further.

Here are the logs:

2021-07-18T05:03:45.033171+00:00 app(web.1): (2021-07-18 05:03:45 +0000) (11) (INFO) Worker exiting (pid: 11)
2021-07-18T05:03:45.224701+00:00 app(web.1): (2021-07-18 05:03:45 +0000) (4) (INFO) Shutting down: Master
2021-07-18T05:03:45.224807+00:00 app(web.1): (2021-07-18 05:03:45 +0000) (4) (INFO) Reason: Worker failed to boot.
2021-07-18T05:03:45.298821+00:00 heroku(web.1): Process exited with status 3
2021-07-18T05:03:45.355650+00:00 heroku(web.1): State changed from up to crashed
2021-07-18T05:03:45.363921+00:00 heroku(web.1): State changed from crashed to starting
2021-07-18T05:03:49.549188+00:00 heroku(web.1): Starting process with command gunicorn main:app
2021-07-18T05:03:52.224751+00:00 app(web.1): (2021-07-18 05:03:52 +0000) (4) (INFO) Starting gunicorn 19.9.0
2021-07-18T05:03:52.225301+00:00 app(web.1): (2021-07-18 05:03:52 +0000) (4) (INFO) Listening at: http://0.0.0.0:33915 (4)
2021-07-18T05:03:52.225472+00:00 app(web.1): (2021-07-18 05:03:52 +0000) (4) (INFO) Using worker: sync
2021-07-18T05:03:52.229628+00:00 app(web.1): (2021-07-18 05:03:52 +0000) (10) (INFO) Booting worker with pid: 10
2021-07-18T05:03:52.252603+00:00 app(web.1): (2021-07-18 05:03:52 +0000) (11) (INFO) Booting worker with pid: 11
2021-07-18T05:03:53.692373+00:00 app(web.1): (2021-07-18 05:03:53 +0000) (10) (ERROR) Exception in worker process
2021-07-18T05:03:53.692383+00:00 app(web.1): Traceback (most recent call last):
2021-07-18T05:03:53.692384+00:00 app(web.1): File “/app/.heroku/python/lib/python3.7/site-packages/gunicorn/arbiter.py”, line 583, in spawn_worker
2021-07-18T05:03:53.692385+00:00 app(web.1): worker.init_process()
2021-07-18T05:03:53.692385+00:00 app(web.1): File “/app/.heroku/python/lib/python3.7/site-packages/gunicorn/workers/base.py”, line 129, in init_process
2021-07-18T05:03:53.692385+00:00 app(web.1): self.load_wsgi()
2021-07-18T05:03:53.692386+00:00 app(web.1): File “/app/.heroku/python/lib/python3.7/site-packages/gunicorn/workers/base.py”, line 138, in load_wsgi
2021-07-18T05:03:53.692386+00:00 app(web.1): self.wsgi = self.app.wsgi()
2021-07-18T05:03:53.692386+00:00 app(web.1): File “/app/.heroku/python/lib/python3.7/site-packages/gunicorn/app/base.py”, line 67, in wsgi
2021-07-18T05:03:53.692387+00:00 app(web.1): self.callable = self.load()
2021-07-18T05:03:53.692387+00:00 app(web.1): File “/app/.heroku/python/lib/python3.7/site-packages/gunicorn/app/wsgiapp.py”, line 52, in load
2021-07-18T05:03:53.692387+00:00 app(web.1): return self.load_wsgiapp()
2021-07-18T05:03:53.692387+00:00 app(web.1): File “/app/.heroku/python/lib/python3.7/site-packages/gunicorn/app/wsgiapp.py”, line 41, in load_wsgiapp
2021-07-18T05:03:53.692388+00:00 app(web.1): return util.import_app(self.app_uri)
2021-07-18T05:03:53.692388+00:00 app(web.1): File “/app/.heroku/python/lib/python3.7/site-packages/gunicorn/util.py”, line 350, in import_app
2021-07-18T05:03:53.692388+00:00 app(web.1): import(module)
2021-07-18T05:03:53.692388+00:00 app(web.1): File “/app/main.py”, line 2, in
2021-07-18T05:03:53.692389+00:00 app(web.1): from models import db, Kundendaten
2021-07-18T05:03:53.692389+00:00 app(web.1): File “/app/models.py”, line 10, in
2021-07-18T05:03:53.692389+00:00 app(web.1): conn = psycopg2.connect(db, sslmode=’require’)
2021-07-18T05:03:53.692389+00:00 app(web.1): File “/app/.heroku/python/lib/python3.7/site-packages/psycopg2/init.py”, line 126, in connect
2021-07-18T05:03:53.692390+00:00 app(web.1): dsn = _ext.make_dsn(dsn, **kwargs)
2021-07-18T05:03:53.692390+00:00 app(web.1): File “/app/.heroku/python/lib/python3.7/site-packages/psycopg2/extensions.py”, line 167, in make_dsn
2021-07-18T05:03:53.692390+00:00 app(web.1): tmp = parse_dsn(dsn)
2021-07-18T05:03:53.692390+00:00 app(web.1): TypeError: Expected bytes or unicode string, got SQLAlchemy instead
2021-07-18T05:03:53.692598+00:00 app(web.1): (2021-07-18 05:03:53 +0000) (10) (INFO) Worker exiting (pid: 10)
2021-07-18T05:03:53.697024+00:00 app(web.1): (2021-07-18 05:03:53 +0000) (11) (ERROR) Exception in worker process
2021-07-18T05:03:53.697025+00:00 app(web.1): Traceback (most recent call last):
2021-07-18T05:03:53.697026+00:00 app(web.1): File “/app/.heroku/python/lib/python3.7/site-packages/gunicorn/arbiter.py”, line 583, in spawn_worker
2021-07-18T05:03:53.697026+00:00 app(web.1): worker.init_process()
2021-07-18T05:03:53.697027+00:00 app(web.1): File “/app/.heroku/python/lib/python3.7/site-packages/gunicorn/workers/base.py”, line 129, in init_process
2021-07-18T05:03:53.697027+00:00 app(web.1): self.load_wsgi()
2021-07-18T05:03:53.697027+00:00 app(web.1): File “/app/.heroku/python/lib/python3.7/site-packages/gunicorn/workers/base.py”, line 138, in load_wsgi
2021-07-18T05:03:53.697028+00:00 app(web.1): self.wsgi = self.app.wsgi()
2021-07-18T05:03:53.697028+00:00 app(web.1): File “/app/.heroku/python/lib/python3.7/site-packages/gunicorn/app/base.py”, line 67, in wsgi
2021-07-18T05:03:53.697029+00:00 app(web.1): self.callable = self.load()
2021-07-18T05:03:53.697029+00:00 app(web.1): File “/app/.heroku/python/lib/python3.7/site-packages/gunicorn/app/wsgiapp.py”, line 52, in load
2021-07-18T05:03:53.697030+00:00 app(web.1): return self.load_wsgiapp()
2021-07-18T05:03:53.697030+00:00 app(web.1): File “/app/.heroku/python/lib/python3.7/site-packages/gunicorn/app/wsgiapp.py”, line 41, in load_wsgiapp
2021-07-18T05:03:53.697030+00:00 app(web.1): return util.import_app(self.app_uri)
2021-07-18T05:03:53.697031+00:00 app(web.1): File “/app/.heroku/python/lib/python3.7/site-packages/gunicorn/util.py”, line 350, in import_app
2021-07-18T05:03:53.697031+00:00 app(web.1): import(module)
2021-07-18T05:03:53.697032+00:00 app(web.1): File “/app/main.py”, line 2, in
2021-07-18T05:03:53.697032+00:00 app(web.1): from models import db, Kundendaten
2021-07-18T05:03:53.697032+00:00 app(web.1): File “/app/models.py”, line 10, in
2021-07-18T05:03:53.697033+00:00 app(web.1): conn = psycopg2.connect(db, sslmode=’require’)
2021-07-18T05:03:53.697033+00:00 app(web.1): File “/app/.heroku/python/lib/python3.7/site-packages/psycopg2/init.py”, line 126, in connect
2021-07-18T05:03:53.697034+00:00 app(web.1): dsn = _ext.make_dsn(dsn, **kwargs)
2021-07-18T05:03:53.697034+00:00 app(web.1): File “/app/.heroku/python/lib/python3.7/site-packages/psycopg2/extensions.py”, line 167, in make_dsn
2021-07-18T05:03:53.697034+00:00 app(web.1): tmp = parse_dsn(dsn)
2021-07-18T05:03:53.697035+00:00 app(web.1): TypeError: Expected bytes or unicode string, got SQLAlchemy instead
2021-07-18T05:03:53.697214+00:00 app(web.1): (2021-07-18 05:03:53 +0000) (11) (INFO) Worker exiting (pid: 11)
2021-07-18T05:03:53.780748+00:00 app(web.1): Traceback (most recent call last):
2021-07-18T05:03:53.780755+00:00 app(web.1): File “/app/.heroku/python/lib/python3.7/site-packages/gunicorn/arbiter.py”, line 210, in run
2021-07-18T05:03:53.781026+00:00 app(web.1): self.sleep()
2021-07-18T05:03:53.781030+00:00 app(web.1): File “/app/.heroku/python/lib/python3.7/site-packages/gunicorn/arbiter.py”, line 360, in sleep
2021-07-18T05:03:53.781271+00:00 app(web.1): ready = select.select((self.PIPE(0)), (), (), 1.0)
2021-07-18T05:03:53.781274+00:00 app(web.1): File “/app/.heroku/python/lib/python3.7/site-packages/gunicorn/arbiter.py”, line 245, in handle_chld
2021-07-18T05:03:53.781481+00:00 app(web.1): self.reap_workers()
2021-07-18T05:03:53.781484+00:00 app(web.1): File “/app/.heroku/python/lib/python3.7/site-packages/gunicorn/arbiter.py”, line 525, in reap_workers
2021-07-18T05:03:53.781715+00:00 app(web.1): raise HaltServer(reason, self.WORKER_BOOT_ERROR)
2021-07-18T05:03:53.781813+00:00 app(web.1): gunicorn.errors.HaltServer: <HaltServer ‘Worker failed to boot.’ 3>
2021-07-18T05:03:53.781815+00:00 app(web.1):
2021-07-18T05:03:53.781816+00:00 app(web.1): During handling of the above exception, another exception occurred:
2021-07-18T05:03:53.781816+00:00 app(web.1):
2021-07-18T05:03:53.781854+00:00 app(web.1): Traceback (most recent call last):
2021-07-18T05:03:53.781855+00:00 app(web.1): File “/app/.heroku/python/bin/gunicorn”, line 8, in
2021-07-18T05:03:53.781949+00:00 app(web.1): sys.exit(run())
2021-07-18T05:03:53.781952+00:00 app(web.1): File “/app/.heroku/python/lib/python3.7/site-packages/gunicorn/app/wsgiapp.py”, line 61, in run
2021-07-18T05:03:53.782111+00:00 app(web.1): WSGIApplication(“%(prog)s (OPTIONS) (APP_MODULE)”).run()
2021-07-18T05:03:53.782115+00:00 app(web.1): File “/app/.heroku/python/lib/python3.7/site-packages/gunicorn/app/base.py”, line 223, in run
2021-07-18T05:03:53.782323+00:00 app(web.1): super(Application, self).run()
2021-07-18T05:03:53.782324+00:00 app(web.1): File “/app/.heroku/python/lib/python3.7/site-packages/gunicorn/app/base.py”, line 72, in run
2021-07-18T05:03:53.782470+00:00 app(web.1): Arbiter(self).run()
2021-07-18T05:03:53.782471+00:00 app(web.1): File “/app/.heroku/python/lib/python3.7/site-packages/gunicorn/arbiter.py”, line 232, in run
2021-07-18T05:03:53.782623+00:00 app(web.1): self.halt(reason=inst.reason, exit_status=inst.exit_status)
2021-07-18T05:03:53.782623+00:00 app(web.1): File “/app/.heroku/python/lib/python3.7/site-packages/gunicorn/arbiter.py”, line 345, in halt
2021-07-18T05:03:53.782837+00:00 app(web.1): self.stop()
2021-07-18T05:03:53.782841+00:00 app(web.1): File “/app/.heroku/python/lib/python3.7/site-packages/gunicorn/arbiter.py”, line 393, in stop
2021-07-18T05:03:53.783075+00:00 app(web.1): time.sleep(0.1)
2021-07-18T05:03:53.783075+00:00 app(web.1): File “/app/.heroku/python/lib/python3.7/site-packages/gunicorn/arbiter.py”, line 245, in handle_chld
2021-07-18T05:03:53.783277+00:00 app(web.1): self.reap_workers()
2021-07-18T05:03:53.783278+00:00 app(web.1): File “/app/.heroku/python/lib/python3.7/site-packages/gunicorn/arbiter.py”, line 525, in reap_workers
2021-07-18T05:03:53.783488+00:00 app(web.1): raise HaltServer(reason, self.WORKER_BOOT_ERROR)
2021-07-18T05:03:53.783528+00:00 app(web.1): gunicorn.errors.HaltServer: <HaltServer ‘Worker failed to boot.’ 3>
2021-07-18T05:03:53.847961+00:00 heroku(web.1): Process exited with status 1
2021-07-18T05:03:53.902510+00:00 heroku(web.1): State changed from starting to crashed
2021-07-18T05:04:05.753522+00:00 heroku(router): at=error code=H10 desc=”App crashed” method=GET path=”/” host=kundendaten.herokuapp.com request_id=c741a098-aa6a-42a2-b04b-3a1c10eadc31 fwd=”91.93.174.51″ dyno= connect= service= status=503 bytes= protocol=https

Selenium: The process started from chrome location /usr/bin/google-chrome is no longer running, so ChromeDriver is assuming that Chrome has crashed

I am trying to install and configure the Selenium command line runner in Amazon EC2 Ubuntu 20.04 instance.

https://www.selenium.dev/selenium-ide/docs/en/introduction/command-line-runner

But when running the command selenium-side-runner Mynew.side, I faced the following error.

info:    Running Mynew.side
 FAIL  ./MySuiteOne.test.js
  ● Test suite failed to run

    WebDriverError: unknown error: Chrome failed to start: exited abnormally.
      (unknown error: DevToolsActivePort file doesn't exist)
      (The process started from chrome location /usr/bin/google-chrome is no longer running, so ChromeDriver is assuming that Chrome has crashed.)

      at Object.throwDecodedError (../../usr/local/lib/node_modules/selenium-side-runner/node_modules/selenium-webdriver/lib/error.js:550:15)
      at parseHttpResponse (../../usr/local/lib/node_modules/selenium-side-runner/node_modules/selenium-webdriver/lib/http.js:560:13)
      at Executor.execute (../../usr/local/lib/node_modules/selenium-side-runner/node_modules/selenium-webdriver/lib/http.js:486:26)

Test Suites: 1 failed, 1 total

Here is the (.side) I exported from file Selenium IDE as an extension of the chrome browser

{
  "id": "6fe36969-3843-4f1d-ab08-c4c2887f44ed",
  "version": "2.0",
  "name": "Mynew",
  "url": "https://opensource-demo.orangehrmlive.com/index.php/auth/login",
  "tests": ({
    "id": "f227a3fa-4d62-4a4d-9f11-8b461a727c23",
    "name": "MytestOne",
    "commands": ({
      "id": "4c29844f-7f52-4b27-a20d-73eb392c3f09",
      "comment": "",
      "command": "open",
      "target": "https://opensource-demo.orangehrmlive.com/index.php/auth/login",
      "targets": (),
      "value": ""
    }, {
      "id": "b19287f1-0dd4-426f-91dc-029e33c2768a",
      "comment": "",
      "command": "setWindowSize",
      "target": "1050x708",
      "targets": (),
      "value": ""
    }, {
      "id": "7b1eb8bb-850a-426a-a037-715fab5e38a2",
      "comment": "",
      "command": "click",
      "target": "id=txtUsername",
      "targets": (
        ("id=txtUsername", "id"),
        ("name=txtUsername", "name"),
        ("css=#txtUsername", "css:finder"),
        ("xpath=//input(@id='txtUsername')", "xpath:attributes"),
        ("xpath=//div(@id='divUsername')/input", "xpath:idRelative"),
        ("xpath=//div(2)/input", "xpath:position")
      ),
      "value": ""
    }, {
      "id": "8888ace2-2c67-4b05-b113-aef8c69c6bdb",
      "comment": "",
      "command": "type",
      "target": "id=txtUsername",
      "targets": (
        ("id=txtUsername", "id"),
        ("name=txtUsername", "name"),
        ("css=#txtUsername", "css:finder"),
        ("xpath=//input(@id='txtUsername')", "xpath:attributes"),
        ("xpath=//div(@id='divUsername')/input", "xpath:idRelative"),
        ("xpath=//div(2)/input", "xpath:position")
      ),
      "value": "Admin"
    }, {
      "id": "ad27d038-0e59-4bfd-afb1-ae190c58960f",
      "comment": "",
      "command": "click",
      "target": "id=frmLogin",
      "targets": (
        ("id=frmLogin", "id"),
        ("css=#frmLogin", "css:finder"),
        ("xpath=//form(@id='frmLogin')", "xpath:attributes"),
        ("xpath=//div(@id='divLoginForm')/form", "xpath:idRelative"),
        ("xpath=//form", "xpath:position")
      ),
      "value": ""
    }, {
      "id": "8912fdd1-f7dc-4a6a-876e-4473d21a5198",
      "comment": "",
      "command": "click",
      "target": "id=txtPassword",
      "targets": (
        ("id=txtPassword", "id"),
        ("name=txtPassword", "name"),
        ("css=#txtPassword", "css:finder"),
        ("xpath=//input(@id='txtPassword')", "xpath:attributes"),
        ("xpath=//div(@id='divPassword')/input", "xpath:idRelative"),
        ("xpath=//div(3)/input", "xpath:position")
      ),
      "value": ""
    }, {
      "id": "1cae4fd9-ad05-41d5-886d-da15c80aa53f",
      "comment": "",
      "command": "type",
      "target": "id=txtPassword",
      "targets": (
        ("id=txtPassword", "id"),
        ("name=txtPassword", "name"),
        ("css=#txtPassword", "css:finder"),
        ("xpath=//input(@id='txtPassword')", "xpath:attributes"),
        ("xpath=//div(@id='divPassword')/input", "xpath:idRelative"),
        ("xpath=//div(3)/input", "xpath:position")
      ),
      "value": "admin123"
    }, {
      "id": "cdd370c8-3197-4484-8177-d38497d8e435",
      "comment": "",
      "command": "click",
      "target": "id=btnLogin",
      "targets": (
        ("id=btnLogin", "id"),
        ("name=Submit", "name"),
        ("css=#btnLogin", "css:finder"),
        ("xpath=//input(@id='btnLogin')", "xpath:attributes"),
        ("xpath=//div(@id='divLoginButton')/input", "xpath:idRelative"),
        ("xpath=//div(5)/input", "xpath:position")
      ),
      "value": ""
    }, {
      "id": "6a9375a3-b0f5-4139-b970-74e255008439",
      "comment": "",
      "command": "click",
      "target": "id=welcome",
      "targets": (
        ("id=welcome", "id"),
        ("linkText=Welcome Peter", "linkText"),
        ("css=#welcome", "css:finder"),
        ("xpath=//a(contains(text(),'Welcome Peter'))", "xpath:link"),
        ("xpath=//a(@id='welcome')", "xpath:attributes"),
        ("xpath=//div(@id='branding')/a(2)", "xpath:idRelative"),
        ("xpath=//a(contains(@href, "https://serverfault.com/#"))", "xpath:href"),
        ("xpath=//a(2)", "xpath:position"),
        ("xpath=//a(contains(.,'Welcome Peter'))", "xpath:innerText")
      ),
      "value": ""
    }, {
      "id": "20fb027f-f8c1-4dd1-825c-d6f0ed938baa",
      "comment": "",
      "command": "click",
      "target": "linkText=Logout",
      "targets": (
        ("linkText=Logout", "linkText"),
        ("css=#welcome-menu li:nth-child(3) > a", "css:finder"),
        ("xpath=//a(contains(text(),'Logout'))", "xpath:link"),
        ("xpath=//div(@id='welcome-menu')/ul/li(3)/a", "xpath:idRelative"),
        ("xpath=//a(contains(@href, '/index.php/auth/logout'))", "xpath:href"),
        ("xpath=//li(3)/a", "xpath:position"),
        ("xpath=//a(contains(.,'Logout'))", "xpath:innerText")
      ),
      "value": ""
    }, {
      "id": "4ccf113b-b7bb-4ca9-b8be-acf7c90ade36",
      "comment": "",
      "command": "close",
      "target": "",
      "targets": (),
      "value": ""
    })
  }),
  "suites": ({
    "id": "1943d405-1ba8-4bc5-b54e-6e4fe64708d7",
    "name": "MySuiteOne",
    "persistSession": false,
    "parallel": true,
    "timeout": 300,
    "tests": ("f227a3fa-4d62-4a4d-9f11-8b461a727c23")
  }),
  "urls": ("https://opensource-demo.orangehrmlive.com/index.php/auth/login"),
  "plugins": ()
}

Please let me know what I am missing.

django – error code=H10 desc=”App crashed” method=GET I Have Installed Gunicorn But Its Showing Error

django – error code=H10 desc=”App crashed” method=GET I Have Installed Gunicorn But Its Showing Error – Stack Overflow

Cpanel latest build crashed IMAP

Hi,

My CPanel server has just updated to 96.0.5 and now lost all IMAP connections for all email accounts
can anyone help

[root@xxxx ~]# /s… | Read the rest of https://www.webhostingtalk.com/showthread.php?t=1845758&goto=newpost

How to Fix Crashed Card

This Center Card Begin Crash When The Site Is Loading Done (Only Random On Firefox) (In Chrome and Opera Begin Fine)
I don’t Know This is About Css Section Or PHP

Crashed:
enter image description here

Orginal:
enter image description here

Moto Z2 Play crashed, now stuck in boot mode

Phone crashed (apps suddenly started flashing up and went to black screen). Now stuck on the M for Motorola when I try to reboot. I got a unique_key unlock code from Motorola and used the command fastboot oem unlock UNIQUE_KEY but when it executes I keep getting: "Check ‘Allow OEM Unlock’ in Android Settings" but of course I cannot access Android Setting since phone is stuck in boot mode. Anyway to get around this? Have unsuccessfully tried recovery and factory mode from the Flashboot Flash Mode screen as well. Thanks!

How To Recover A Crashed Raid 5?

How to recover a crashed RAID 5?

t sql – SQLAnywhere/Sybase – General error when trying to count number of occurrences, crashed server

I’m trying to do something that seems relatively simple.
The below query returns a list of “case numbers” and the name of an associated “referrer” among other junk.
I’m trying to count the number of times each individual referrer name appears in the results.

When run, the query below returns: “Error: General Error”, and it actually crashes the entire server seconds later. posted entire query instead of just relevant lines since the entirety of this query is crashing the server.

In line 6, each individual referrer is listed under column ‘referrer’.
In lines 7-12, I’m trying to count the number of times each individual referrer occurs

Any insight? First how can I simply count number of occurrences for each referrer… and second why the heck is my server crashing from this select query!?

select 
casenum, 
matcode as casetype, 
date_opened, 
sp_first_party(casenum) as client, 
sp_name(referred_link,1) as referrer,
    (
        SELECT first
            count(sp_name(referred_link,1))
            from cases
            group by referrer
    ),
(case when mailing_list is null then 'No'else 'Yes' end) as old_mattar_star, 
'repeat client' as reason, 
names.email as 'client email' 
from cases
inner join party on cases.casenum=party.case_id
left join (select * from mailing_list_defined where mailing_list='Mattar Stars') a
on party.party_id=a.names_id
inner join names on cases.referred_link=names.names_id
where party.role='Plaintiff' 
and party.our_client='Y' 
and date_opened>='2020-01-01' 
and date_opened<='2021-01-01'
and cases.case_date_6 is null
and party.party_id IN 
(select party_id from 
(select count(casenum) as casecount, party_id from cases
inner join party on cases.casenum=party.case_id
where party.role='Plaintiff' and party.our_client='Y'
and matcode IN ('PMV','MVA','IMV','GPI','IGP','S%F','ISF')
group by party_id) multicases
where multicases.casecount>=2)

windows 10 – Win10 startup crashed / Drive with Bitlocker unable to repair

I have a laptop (T14) with Win10 installed. Recently, it crashed and on startup it automatically goes to repair mode.

Drive is locked with Bitlocker (I have the key available). So when I log in I try chkdsk which doesn’t work as it says the drive is in readonly. When I try to clean attribute it tells me disk has errors and I need to repair them first for attributes to be cleared.

I tried with USB with win installation on them. I cannot do format because the drive is locked with Bitlocker. I tried to suspend it but was unable, it returns error.

So I am open to any solutions, repair the existing windows, formatting the drive… anything I don’t mind just to get it up and running. Thx!

DreamProxies - Cheapest USA Elite Private Proxies 100 Private Proxies 200 Private Proxies 400 Private Proxies 1000 Private Proxies 2000 Private Proxies 5000 Private Proxies ExtraProxies.com - Buy Cheap Private Proxies Buy 50 Private Proxies Buy 100 Private Proxies Buy 200 Private Proxies Buy 500 Private Proxies Buy 1000 Private Proxies Buy 2000 Private Proxies ProxiesLive.com Proxies-free.com New Proxy Lists Every Day Proxies123.com Buy Cheap Private Proxies; Best Quality USA Private Proxies